I've been trying to install php onto a Unix server and have managed to run the ./configure command successfully. However, when I run make I get the following:-
root@saffron # make
Making all in Zend
make[1]: Entering directory `/php-4.2.3/Zend'
/bin/sh ../libtool --silent --mode=link gcc -g -O2 -prefer-non-pic -static -o
libZend.la zend_language_parser.lo zend_language_scanner.lo zend_ini_parser.lo
zend_ini_scanner.lo zend_alloc.lo zend_compile.lo zend_constants.lo zend_dynami
c_array.lo zend_execute.lo zend_execute_API.lo zend_highlight.lo zend_llist.lo z
end_opcode.lo zend_operators.lo zend_ptr_stack.lo zend_stack.lo zend_variables.l
o zend.lo zend_API.lo zend_extensions.lo zend_hash.lo zend_list.lo zend_indent.l
o zend_builtin_functions.lo zend_sprintf.lo zend_ini.lo zend_qsort.lo -ldl
../libtool: ar: not found
make[1]: *** [libZend.la] Error 1
make[1]: Leaving directory `/php-4.2.3/Zend'
make: *** [all-recursive] Error 1
Any ideas what the problem is?
Cheers, CS
root@saffron # make
Making all in Zend
make[1]: Entering directory `/php-4.2.3/Zend'
/bin/sh ../libtool --silent --mode=link gcc -g -O2 -prefer-non-pic -static -o
libZend.la zend_language_parser.lo zend_language_scanner.lo zend_ini_parser.lo
zend_ini_scanner.lo zend_alloc.lo zend_compile.lo zend_constants.lo zend_dynami
c_array.lo zend_execute.lo zend_execute_API.lo zend_highlight.lo zend_llist.lo z
end_opcode.lo zend_operators.lo zend_ptr_stack.lo zend_stack.lo zend_variables.l
o zend.lo zend_API.lo zend_extensions.lo zend_hash.lo zend_list.lo zend_indent.l
o zend_builtin_functions.lo zend_sprintf.lo zend_ini.lo zend_qsort.lo -ldl
../libtool: ar: not found
make[1]: *** [libZend.la] Error 1
make[1]: Leaving directory `/php-4.2.3/Zend'
make: *** [all-recursive] Error 1
Any ideas what the problem is?
Cheers, CS